Target
Nischarin
Ligand
BDBM50262235
Substrate
Meas. Tech.
ChEMBL_828755 (CHEMBL2060405)
Ki
11±n/a nM
Citation
 Schann, SGreney, HGasparik, VDontenwill, MRascente, CLacroix, GMonassier, LBruban, VFeldman, JEhrhardt, JDBousquet, P Methylation of imidazoline related compounds leads to loss ofa2-adrenoceptor affinity. Synthesis and biological evaluation of selective I1 imidazoline receptor ligands. Bioorg Med Chem 20:4710-5 (2012)  
Target
Name:
Nischarin
Synonyms:
Imidazoline I1 Nisch | Nischarin
Type:
Enzyme Catalytic Domain
Mol. Mass.:
166460.59
Organism:
RAT
Description:
Q4G017
Residue:
1502
  
Inhibitor
Name:
BDBM50262235
Synonyms:
rilmenidine
Type:
Small organic molecule
Emp. Form.:
C10H17N2O
Mol. Mass.:
181.2542
SMILES:
C1CC1C(NC1=[NH+]CCO1)C1CC1
: