Target
Glucose-dependent insulinotropic receptor
Ligand
BDBM50387900
Substrate
Meas. Tech.
ChEMBL_830706 (CHEMBL2061693)
EC50
515±n/a nM
Citation
 Sakairi, MKogami, MTorii, MKataoka, HFujieda, HMakino, MKataoka, DOkamoto, RMiyazawa, TOkabe, MInoue, MTakahashi, NHarada, SWatanabe, N Synthesis and SAR studies of bicyclic amine series GPR119 agonists. Bioorg Med Chem Lett 22:5123-8 (2012)  
Target
Name:
Glucose-dependent insulinotropic receptor
Synonyms:
GP119_MOUSE | Gpr119
Type:
PROTEIN
Mol. Mass.:
37009.07
Organism:
Mus musculus
Description:
ChEMBL_1506420
Residue:
335
  
Inhibitor
Name:
BDBM50387900
Synonyms:
CHEMBL2058401
Type:
Small organic molecule
Emp. Form.:
C21H31N3O3
Mol. Mass.:
373.4891
SMILES:
CC(C)(C)OC(=O)N1CCC(CCCNc2ccc3C(=O)NCc3c2)CC1
: