Target
Dipeptidyl peptidase 4
Ligand
BDBM50388112
Substrate
Meas. Tech.
ChEMBL_829355 (CHEMBL2060146)
IC50
0.37±n/a nM
Citation
 Yoshida, TAkahoshi, FSakashita, HSonda, STakeuchi, MTanaka, YNabeno, MKishida, HMiyaguchi, IHayashi, Y Fused bicyclic heteroarylpiperazine-substituted L-prolylthiazolidines as highly potent DPP-4 inhibitors lacking the electrophilic nitrile group. Bioorg Med Chem 20:5033-41 (2012)  
Target
Name:
Dipeptidyl peptidase 4
Synonyms:
ADABP Adenosine deaminase complexing protein 2 CD_antigen=CD26 DPP4 DPPIV Dipeptidyl peptidase 4 (DPP IV) Dipeptidyl peptidase 4 (DPP4) Dipeptidyl peptidase 4 membrane form Dipeptidyl peptidase IV Dipeptidyl peptidase IV (DDP-IV) Dipeptidyl peptidase IV membrane form Dipeptidyl peptidase-IV (DPP-4) T-cell activation antigen CD26 | TP103
Type:
Enzyme
Mol. Mass.:
88271.01
Organism:
Homo sapiens (Human)
Description:
P27487
Residue:
766
  
Inhibitor
Name:
BDBM50388112
Synonyms:
CHEMBL2058971
Type:
Small organic molecule
Emp. Form.:
C22H26F3N5OS
Mol. Mass.:
465.535
SMILES:
FC(F)(F)c1cc(N2CCN(CC2)[C@@H]2CN[C@@H](C2)C(=O)N2CCSC2)c2ccccc2n1
: