Target
Eukaryotic initiation factor 4A-I
Ligand
BDBM50388144
Substrate
Meas. Tech.
ChEMBL_828664 (CHEMBL2060258)
IC50
0.5±n/a nM
Citation
 Rodrigo, CMCencic, RRoche, SPPelletier, JPorco, JA Synthesis of rocaglamide hydroxamates and related compounds as eukaryotic translation inhibitors: synthetic and biological studies. J Med Chem 55:558-62 (2012)  
Target
Name:
Eukaryotic initiation factor 4A-I
Synonyms:
ATP-dependent RNA helicase eIF4A-1 EIF4A IF4A1_HUMAN eIF4A-I
Type:
PROTEIN
Mol. Mass.:
46146.87
Organism:
Homo sapiens (Human)
Description:
ChEMBL_864983
Residue:
406
  
Inhibitor
Name:
BDBM50388144
Synonyms:
CHEMBL2058177
Type:
Small organic molecule
Emp. Form.:
C28H29NO8
Mol. Mass.:
507.5318
SMILES:
CONC(=O)[C@H]1[C@@H](O)[C@@]2(O)c3c(O[C@]2([C@@H]1c1ccccc1)c1ccc(OC)cc1)cc(OC)cc3OC
: