Target
Tyrosine-protein kinase BTK
Ligand
BDBM50388189
Substrate
Meas. Tech.
ChEMBL_829002 (CHEMBL2060652)
IC50
0.3±n/a nM
Citation
 Lou, YOwens, TDKuglstatter, AKondru, RKGoldstein, DM Bruton's tyrosine kinase inhibitors: approaches to potent and selective inhibition, preclinical and clinical evaluation for inflammatory diseases and B cell malignancies. J Med Chem 55:4539-50 (2012)  
Target
Name:
Tyrosine-protein kinase BTK
Synonyms:
AGMX1 Agammaglobulinaemia tyrosine kinase B cell progenitor kinase BPK BTK_HUMAN Tyrosine Kinase BTK Tyrosine-protein kinase BTK (BTK)
Type:
Enzyme
Mol. Mass.:
76289.95
Organism:
Homo sapiens (Human)
Description:
Q06187
Residue:
659
  
Inhibitor
Name:
BDBM50388189
Synonyms:
CHEMBL2057918
Type:
Small organic molecule
Emp. Form.:
C35H35FN6O3
Mol. Mass.:
606.6892
SMILES:
CN1CCN(CC1)c1ccc(Nc2cc(cn(C)c2=O)-c2cccc(c2CO)-n2ccc3cc(cc(F)c3c2=O)C2CC2)nc1
: