Target
DNA-(apurinic or apyrimidinic site) endonuclease
Ligand
BDBM50388236
Substrate
Meas. Tech.
ChEMBL_829669 (CHEMBL2061059)
IC50
5000±n/a nM
Citation
 Rai, GVyjayanti, VNDorjsuren, DSimeonov, AJadhav, AWilson, DMMaloney, DJ Synthesis, biological evaluation, and structure-activity relationships of a novel class of apurinic/apyrimidinic endonuclease 1 inhibitors. J Med Chem 55:3101-12 (2012)  
Target
Name:
DNA-(apurinic or apyrimidinic site) endonuclease
Synonyms:
APE APEX APEX1_HUMAN Apurinic-apyrimidinic endonuclease 1 (APE-1) DNA-(apurinic or apyrimidinic site) lyase REF1
Type:
Protein
Mol. Mass.:
35560.12
Organism:
Homo sapiens (Human)
Description:
P27695
Residue:
318
  
Inhibitor
Name:
BDBM50388236
Synonyms:
CHEMBL1721230
Type:
Small organic molecule
Emp. Form.:
C16H15N3OS2
Mol. Mass.:
329.44
SMILES:
CC(=O)Nc1sc2CNCCc2c1-c1nc2ccccc2s1
: