Target
Peptidyl-prolyl cis-trans isomerase FKBP5
Ligand
BDBM50388299
Substrate
Meas. Tech.
ChEMBL_829707 (CHEMBL2061147)
IC50
>50000±n/a nM
Citation
 Gopalakrishnan, RKozany, CWang, YSchneider, SHoogeland, BBracher, AHausch, F Exploration of pipecolate sulfonamides as binders of the FK506-binding proteins 51 and 52. J Med Chem 55:4123-31 (2012)  
Target
Name:
Peptidyl-prolyl cis-trans isomerase FKBP5
Synonyms:
51 kDa FK506-binding protein 54 kDa progesterone receptor-associated immunophilin Androgen-regulated protein 6 FK506-binding protein 5 FKBP-51 FKBP51 FKBP5_HUMAN PPIase FKBP5 p54
Type:
PROTEIN
Mol. Mass.:
51207.06
Organism:
Homo sapiens (Human)
Description:
ChEMBL_952910
Residue:
457
  
Inhibitor
Name:
BDBM50388299
Synonyms:
CHEMBL2058795
Type:
Small organic molecule
Emp. Form.:
C36H44Cl2N2O9S
Mol. Mass.:
751.714
SMILES:
COc1ccc(CC[C@@H](OC(=O)[C@@H]2CCCCN2S(=O)(=O)c2cc(Cl)c(OC)c(Cl)c2)c2cccc(OCCN3CCOCC3)c2)cc1OC
: