Target
Peptidyl-prolyl cis-trans isomerase FKBP5
Ligand
BDBM50388304
Substrate
Meas. Tech.
ChEMBL_829710 (CHEMBL2061150)
IC50
32730±n/a nM
Citation
 Gopalakrishnan, RKozany, CGaali, SKress, CHoogeland, BBracher, AHausch, F Evaluation of synthetic FK506 analogues as ligands for the FK506-binding proteins 51 and 52. J Med Chem 55:4114-22 (2012)  
Target
Name:
Peptidyl-prolyl cis-trans isomerase FKBP5
Synonyms:
51 kDa FK506-binding protein 54 kDa progesterone receptor-associated immunophilin Androgen-regulated protein 6 FK506-binding protein 5 FKBP-51 FKBP51 FKBP5_HUMAN PPIase FKBP5 p54
Type:
PROTEIN
Mol. Mass.:
51207.06
Organism:
Homo sapiens (Human)
Description:
ChEMBL_952910
Residue:
457
  
Inhibitor
Name:
BDBM50388304
Synonyms:
CHEMBL2058802
Type:
Small organic molecule
Emp. Form.:
C32H39NO9
Mol. Mass.:
581.6534
SMILES:
CCC(C)(C)C(=O)C(=O)N1CC=CC[C@H]1C(=O)O[C@H](CCc1ccc(OC)c(OC)c1)c1cccc(OCC(O)=O)c1
: