Target
Peptidyl-prolyl cis-trans isomerase FKBP5
Ligand
BDBM50388314
Substrate
Meas. Tech.
ChEMBL_829710 (CHEMBL2061150)
IC50
4270±n/a nM
Citation
 Gopalakrishnan, RKozany, CGaali, SKress, CHoogeland, BBracher, AHausch, F Evaluation of synthetic FK506 analogues as ligands for the FK506-binding proteins 51 and 52. J Med Chem 55:4114-22 (2012)  
Target
Name:
Peptidyl-prolyl cis-trans isomerase FKBP5
Synonyms:
51 kDa FK506-binding protein 54 kDa progesterone receptor-associated immunophilin Androgen-regulated protein 6 FK506-binding protein 5 FKBP-51 FKBP51 FKBP5_HUMAN PPIase FKBP5 p54
Type:
PROTEIN
Mol. Mass.:
51207.06
Organism:
Homo sapiens (Human)
Description:
ChEMBL_952910
Residue:
457
  
Inhibitor
Name:
BDBM50388314
Synonyms:
CHEMBL2059029
Type:
Small organic molecule
Emp. Form.:
C34H43NO10
Mol. Mass.:
625.7059
SMILES:
COc1ccc(CC[C@@H](OC(=O)[C@@H]2CCCCN2C(=O)C(=O)[C@]2(O)CCCC[C@H]2C)c2cccc(OCC(O)=O)c2)cc1OC
: