Target
Translocator protein
Ligand
BDBM50388401
Substrate
Meas. Tech.
ChEMBL_829916 (CHEMBL2061564)
Ki
3±n/a nM
Citation
 Castellano, STaliani, SMilite, CPugliesi, IDa Pozzo, ERizzetto, EBendinelli, SCosta, BCosconati, SGreco, GNovellino, ESbardella, GStefancich, GMartini, CDa Settimo, F Synthesis and biological evaluation of 4-phenylquinazoline-2-carboxamides designed as a novel class of potent ligands of the translocator protein. J Med Chem 55:4506-10 (2012)  
Target
Name:
Translocator protein
Synonyms:
Benzodiazepine receptors; peripheral & central Mbr PBR Peripheral benzodiazepine receptor (PBR) TSPO_RAT | Tspo
Type:
Mitochondrion membrane protein
Mol. Mass.:
18945.84
Organism:
Rattus norvegicus (rat)
Description:
Competitive binding experiments were performed on rat kidney mitochondrial membranes.
Residue:
169
  
Inhibitor
Name:
BDBM50388401
Synonyms:
CHEMBL2058819
Type:
Small organic molecule
Emp. Form.:
C20H21N3O
Mol. Mass.:
319.4002
SMILES:
CCC(C)N(C)C(=O)c1nc(-c2ccccc2)c2ccccc2n1
: