Target
Sphingosine 1-phosphate receptor 3
Ligand
BDBM50420112
Substrate
Meas. Tech.
ChEMBL_829948 (CHEMBL2061653)
EC50
>10000±n/a nM
Citation
 Ren, FDeng, GWang, HLuan, LMeng, QXu, QXu, HXu, XZhang, HZhao, BLi, CGuo, TBYang, JZhang, WZhao, YJia, QLu, HXiang, JNElliott, JDLin, X Discovery of novel 1,2,4-thiadiazole derivatives as potent, orally active agonists of sphingosine 1-phosphate receptor subtype 1 (S1P(1)). J Med Chem 55:4286-96 (2012)  
Target
Name:
Sphingosine 1-phosphate receptor 3
Synonyms:
C9orf108 EDG3 S1P receptor 3 S1P3 S1PR3_HUMAN Sphingosine 1-phosphate receptor 3 (S1P3) | Sphingosine 1-phosphate receptor Edg-3
Type:
G Protein-Coupled Receptor (GPCR)
Mol. Mass.:
42278.13
Organism:
Homo sapiens (Human)
Description:
Q99500
Residue:
378
  
Inhibitor
Name:
BDBM50420112
Synonyms:
CHEMBL2059685
Type:
Small organic molecule
Emp. Form.:
C27H30F3N3O3S
Mol. Mass.:
533.606
SMILES:
CCc1c(CN2CCC(CC2)C(O)=O)cccc1-c1nsc(n1)-c1ccc(OC(C)C)c(c1)C(F)(F)F
: