Target
Sphingosine 1-phosphate receptor 1
Ligand
BDBM50420113
Substrate
Meas. Tech.
ChEMBL_829947 (CHEMBL2061652)
EC50
0.251±n/a nM
Citation
 Ren, FDeng, GWang, HLuan, LMeng, QXu, QXu, HXu, XZhang, HZhao, BLi, CGuo, TBYang, JZhang, WZhao, YJia, QLu, HXiang, JNElliott, JDLin, X Discovery of novel 1,2,4-thiadiazole derivatives as potent, orally active agonists of sphingosine 1-phosphate receptor subtype 1 (S1P(1)). J Med Chem 55:4286-96 (2012)  
Target
Name:
Sphingosine 1-phosphate receptor 1
Synonyms:
CHEDG1 Endothelial differentiation G-protein coupled receptor 1 S1P1 S1PR1_HUMAN Sphingosine 1-phosphate receptor Edg-1
Type:
Enzyme
Mol. Mass.:
42836.02
Organism:
Homo sapiens (Human)
Description:
P21453
Residue:
382
  
Inhibitor
Name:
BDBM50420113
Synonyms:
CHEMBL2059686
Type:
Small organic molecule
Emp. Form.:
C25H26F3N3O3S
Mol. Mass.:
505.552
SMILES:
CCc1c(CN2CC(C2)C(O)=O)cccc1-c1nsc(n1)-c1ccc(OC(C)C)c(c1)C(F)(F)F
: