Target
5-hydroxytryptamine receptor 4
Ligand
BDBM50388691
Substrate
Meas. Tech.
ChEMBL_829296 (CHEMBL2060286)
Ki
1±n/a nM
Citation
 Long, DDArmstrong, SRBeattie, DTChoi, SKFatheree, PRGendron, RAGoldblum, AAHumphrey, PPMarquess, DGShaw, JPSmith, JADerek Turner, SVickery, RG Discovery, oral pharmacokinetics and in vivo efficacy of a highly selective 5-HT4 receptor agonist: clinical compound TD-2749. Bioorg Med Chem Lett 22:4849-53 (2012)  
Target
Name:
5-hydroxytryptamine receptor 4
Synonyms:
5-HT-4 5-HT4S 5-HT4b 5-HT4d 5-hydroxytryptamine receptor 4 5HT4R_HUMAN Serotonin (5-HT) receptor Serotonin 4 (5-HT4) receptor | Serotonin Receptor 4
Type:
Enzyme
Mol. Mass.:
43767.54
Organism:
Homo sapiens (Human)
Description:
Q13639
Residue:
388
  
Inhibitor
Name:
BDBM50388691
Synonyms:
CHEMBL2059580
Type:
Small organic molecule
Emp. Form.:
C28H45N5O
Mol. Mass.:
467.6898
SMILES:
CC(C)N(C)CCCCCCN1[C@H]2CC[C@@H]1C[C@@H](C2)NC(=O)c1nn(C(C)C)c2ccccc12
: