Target
5-hydroxytryptamine receptor 4
Ligand
BDBM50388701
Substrate
Meas. Tech.
ChEMBL_829296 (CHEMBL2060286)
Ki
1.58±n/a nM
Citation
 Long, DDArmstrong, SRBeattie, DTChoi, SKFatheree, PRGendron, RAGoldblum, AAHumphrey, PPMarquess, DGShaw, JPSmith, JADerek Turner, SVickery, RG Discovery, oral pharmacokinetics and in vivo efficacy of a highly selective 5-HT4 receptor agonist: clinical compound TD-2749. Bioorg Med Chem Lett 22:4849-53 (2012)  
Target
Name:
5-hydroxytryptamine receptor 4
Synonyms:
5-HT-4 5-HT4S 5-HT4b 5-HT4d 5-hydroxytryptamine receptor 4 5HT4R_HUMAN Serotonin (5-HT) receptor Serotonin 4 (5-HT4) receptor | Serotonin Receptor 4
Type:
Enzyme
Mol. Mass.:
43767.54
Organism:
Homo sapiens (Human)
Description:
Q13639
Residue:
388
  
Inhibitor
Name:
BDBM50388701
Synonyms:
CHEMBL2059584
Type:
Small organic molecule
Emp. Form.:
C31H50N6O3S
Mol. Mass.:
586.832
SMILES:
CC(C)n1nc(C(=O)N[C@@H]2C[C@@H]3CC[C@H](C2)N3CCCCCCN2CCC(CNS(C)(=O)=O)CC2)c2ccccc12
: