Target
Dynamin-1
Ligand
BDBM50388827
Substrate
Meas. Tech.
ChEMBL_831002 (CHEMBL2065654)
IC50
18100±n/a nM
Citation
 Robertson, MJHadzic, GAmbrus, JPomè, DYHyde, EWhiting, AMariana, Avon Kleist, LChau, NHaucke, VRobinson, PJMcCluskey, A The Rhodadyns, a New Class of Small Molecule Inhibitors of Dynamin GTPase Activity. ACS Med Chem Lett 3:352-356 (2012)  
Target
Name:
Dynamin-1
Synonyms:
DNM DYN1_HUMAN | Dynamin-1
Type:
PROTEIN
Mol. Mass.:
97411.67
Organism:
Homo sapiens (Human)
Description:
ChEMBL_1458576
Residue:
864
  
Inhibitor
Name:
BDBM50388827
Synonyms:
CHEMBL2062731
Type:
Small organic molecule
Emp. Form.:
C10H5Cl2NOS2
Mol. Mass.:
290.189
SMILES:
SC1=NC(=O)C(S1)=Cc1cc(Cl)cc(Cl)c1
: