Target
Procathepsin L
Ligand
BDBM50388853
Substrate
Meas. Tech.
ChEMBL_831047 (CHEMBL2065748)
IC50
>10000±n/a nM
Citation
 Song, JJones, LMKumar, GDConner, ESBayeh, LChavarria, GECharlton-Sevcik, AKChen, SEChaplin, DJTrawick, MLPinney, KG Synthesis and biochemical evaluation of thiochromanone thiosemicarbazone analogues as inhibitors of cathepsin L. ACS Med Chem Lett 3:450-453 (2012)  
Target
Name:
Procathepsin L
Synonyms:
CATL1_HUMAN CTSL CTSL1 Cathepsin L Cathepsin L1 heavy chain MEP cathepsin L preproprotein
Type:
Enzyme
Mol. Mass.:
37557.19
Organism:
Homo sapiens (Human)
Description:
Purchased from Calbiochem (San Diego, CA).
Residue:
333
  
Inhibitor
Name:
BDBM50388853
Synonyms:
CHEMBL2062911
Type:
Small organic molecule
Emp. Form.:
C12H14N4OS2
Mol. Mass.:
294.396
SMILES:
CC(=O)Nc1ccc2SCCC(=NNC(N)=S)c2c1
: