Target
Cathepsin B
Ligand
BDBM50388852
Substrate
Meas. Tech.
ChEMBL_831048 (CHEMBL2065749)
IC50
>10000±n/a nM
Citation
 Song, JJones, LMKumar, GDConner, ESBayeh, LChavarria, GECharlton-Sevcik, AKChen, SEChaplin, DJTrawick, MLPinney, KG Synthesis and biochemical evaluation of thiochromanone thiosemicarbazone analogues as inhibitors of cathepsin L. ACS Med Chem Lett 3:450-453 (2012)  
Target
Name:
Cathepsin B
Synonyms:
APP secretase CATB_HUMAN CTSB Cathepsin B light chain | Cathepsin B1
Type:
Enzyme
Mol. Mass.:
37819.69
Organism:
Homo sapiens (Human)
Description:
gi_63102437
Residue:
339
  
Inhibitor
Name:
BDBM50388852
Synonyms:
CHEMBL2062910
Type:
Small organic molecule
Emp. Form.:
C10H12N4S2
Mol. Mass.:
252.359
SMILES:
NC(=S)NN=C1CCSc2ccc(N)cc12
: