Target
Botulinum neurotoxin type A
Ligand
BDBM50388868
Substrate
Meas. Tech.
ChEMBL_831051 (CHEMBL2065752)
IC50
31500±n/a nM
Citation
 Cardellina, JHRoxas-Duncan, VIMontgomery, VEccard, VCampbell, YHu, XKhavrutskii, ITawa, GJWallqvist, AGloer, JBPhatak, NLHöller, USoman, AGJoshi, BKHein, SMWicklow, DTSmith, LA Fungal bis-Naphthopyrones as Inhibitors of Botulinum Neurotoxin Serotype A. ACS Med Chem Lett 3:387-391 (2012)  
Target
Name:
Botulinum neurotoxin type A
Synonyms:
BXA1_CLOBH bna | botA
Type:
PROTEIN
Mol. Mass.:
149421.96
Organism:
Clostridium botulinum (strain Hall / ATCC 3502 / NCTC 13319 / Type A)
Description:
ChEMBL_987932
Residue:
1296
  
Inhibitor
Name:
BDBM50388868
Synonyms:
CHEMBL472851
Type:
Small organic molecule
Emp. Form.:
C30H18O10
Mol. Mass.:
538.4579
SMILES:
Cc1cc(O)c2C(=O)c3c(O)cc(O)c(c3C(=O)c2c1)-c1c(O)cc(O)c2C(=O)c3c(O)cc(C)cc3C(=O)c12
: