Target
Cyclin-dependent kinase 1
Ligand
BDBM50388877
Substrate
Meas. Tech.
ChEMBL_830840 (CHEMBL2065346)
Ki
40±n/a nM
Citation
 Milletti, FHermann, JC Targeted kinase selectivity from kinase profiling data. ACS Med Chem Lett 3:383-386 (2012)  
Target
Name:
Cyclin-dependent kinase 1
Synonyms:
CDC2 CDK1 CDKN1 Cell division protein kinase 1 P34CDC2 | p34 protein kinase
Type:
Enzyme Subunit
Mol. Mass.:
34101.08
Organism:
Homo sapiens (Human)
Description:
P06493
Residue:
297
  
Inhibitor
Name:
BDBM50388877
Synonyms:
CHEMBL2062936
Type:
Small organic molecule
Emp. Form.:
C17H18ClN5O
Mol. Mass.:
343.811
SMILES:
O[C@H]1CC[C@@H](CC1)Nc1nc(Cl)cc(n1)-c1c[nH]c2ncccc12
: