Target
Platelet-derived growth factor receptor alpha
Ligand
BDBM50381716
Substrate
Meas. Tech.
ChEMBL_830844 (CHEMBL2065350)
Ki
0.794328±n/a nM
Citation
 Milletti, FHermann, JC Targeted kinase selectivity from kinase profiling data. ACS Med Chem Lett 3:383-386 (2012)  
Target
Name:
Platelet-derived growth factor receptor alpha
Synonyms:
Alpha-type platelet-derived growth factor receptor PDGFRA PGFRA_HUMAN Platelet-derived growth factor receptor alpha (PDGFRA) RHEPDGFRA
Type:
Protein
Mol. Mass.:
122633.38
Organism:
Homo sapiens (Human)
Description:
P16234
Residue:
1089
  
Inhibitor
Name:
BDBM50381716
Synonyms:
ABT-348 US8722890, 1 | US8722890, 2
Type:
Small organic molecule
Emp. Form.:
C25H21FN6O2S
Mol. Mass.:
488.537
SMILES:
Nc1ncc(-c2cnn(CCO)c2)c2scc(-c3ccc(NC(=O)Nc4cccc(F)c4)cc3)c12
: