Target
Platelet-derived growth factor receptor alpha
Ligand
BDBM50388880
Substrate
Meas. Tech.
ChEMBL_830844 (CHEMBL2065350)
Ki
<10000±n/a nM
Citation
 Milletti, FHermann, JC Targeted kinase selectivity from kinase profiling data. ACS Med Chem Lett 3:383-386 (2012)  
Target
Name:
Platelet-derived growth factor receptor alpha
Synonyms:
Alpha-type platelet-derived growth factor receptor PDGFRA PGFRA_HUMAN Platelet-derived growth factor receptor alpha (PDGFRA) RHEPDGFRA
Type:
Protein
Mol. Mass.:
122633.38
Organism:
Homo sapiens (Human)
Description:
P16234
Residue:
1089
  
Inhibitor
Name:
BDBM50388880
Synonyms:
CHEMBL1979577
Type:
Small organic molecule
Emp. Form.:
C26H25N5OS
Mol. Mass.:
455.575
SMILES:
Cc1cccc(NC(=O)Nc2ccc(cc2)-c2csc3c(cnc(N)c23)C#CC(C)(C)N)c1
: