Target
Muscarinic acetylcholine receptor M3
Ligand
BDBM50258439
Substrate
Meas. Tech.
ChEMBL_832793 (CHEMBL2067889)
EC50
6400±n/a nM
Citation
 Melancon, BJHopkins, CRWood, MREmmitte, KANiswender, CMChristopoulos, AConn, PJLindsley, CW Allosteric modulation of seven transmembrane spanning receptors: theory, practice, and opportunities for central nervous system drug discovery. J Med Chem 55:1445-64 (2012)  
Target
Name:
Muscarinic acetylcholine receptor M3
Synonyms:
ACM3_HUMAN Cholinergic, muscarinic M3 Muscarinic receptor M3 | RecName: Full=Muscarinic acetylcholine receptor M3
Type:
Enzyme
Mol. Mass.:
66151.03
Organism:
Homo sapiens (Human)
Description:
P20309
Residue:
590
  
Inhibitor
Name:
BDBM50258439
Synonyms:
1-(4-bromobenzyl)indoline-2,3-dione CVD-0005886 VU0119498 | cid_3008304
Type:
Small organic molecule
Emp. Form.:
C15H10BrNO2
Mol. Mass.:
316.149
SMILES:
Brc1ccc(CN2C(=O)C(=O)c3ccccc23)cc1
: