Target
C3a anaphylatoxin chemotactic receptor
Ligand
BDBM50389004
Substrate
Meas. Tech.
ChEMBL_832880 (CHEMBL2066642)
EC50
81.28±n/a nM
Citation
 Bellows-Peterson, MLFung, HKFloudas, CAKieslich, CAZhang, LMorikis, DWareham, KJMonk, PNHawksworth, OAWoodruff, TM De novo peptide design with C3a receptor agonist and antagonist activities: theoretical predictions and experimental validation. J Med Chem 55:4159-68 (2012)  
Target
Name:
C3a anaphylatoxin chemotactic receptor
Synonyms:
AZ3B C3AR1 C3R1 HNFAG09
Type:
PROTEIN
Mol. Mass.:
53864.66
Organism:
Homo sapiens (Human)
Description:
ChEMBL_642034
Residue:
482
  
Inhibitor
Name:
BDBM50389004
Synonyms:
CHEMBL2064021
Type:
Small organic molecule
Emp. Form.:
C90H139N31O18
Mol. Mass.:
1943.2636
SMILES:
CC(C)C[C@H](NC(=O)CNC(=O)[C@H](CC(C)C)NC(=O)[C@H](CCCCN)NC(=O)[C@H](CO)NC(=O)[C@H](C)NC(=O)[C@H](CCCN=C(N)N)NC(=O)[C@H](Cc1c[nH]c2ccccc12)NC(=O)[C@H](CCCN=C(N)N)NC(=O)[C@H](CCCN=C(N)N)NC(=O)[C@@H](NC(=O)[C@H](Cc1c[nH]c2ccccc12)NC(=O)[C@@H](N)Cc1c[nH]c2ccccc12)[C@@H](C)O)C(=O)N[C@@H](C)C(=O)N[C@@H](CCCN=C(N)N)C(O)=O
: