Target
C3a anaphylatoxin chemotactic receptor
Ligand
BDBM50388995
Substrate
Meas. Tech.
ChEMBL_832883 (CHEMBL2066645)
EC50
660.69±n/a nM
Citation
 Bellows-Peterson, MLFung, HKFloudas, CAKieslich, CAZhang, LMorikis, DWareham, KJMonk, PNHawksworth, OAWoodruff, TM De novo peptide design with C3a receptor agonist and antagonist activities: theoretical predictions and experimental validation. J Med Chem 55:4159-68 (2012)  
Target
Name:
C3a anaphylatoxin chemotactic receptor
Synonyms:
AZ3B C3AR1 C3R1 HNFAG09
Type:
PROTEIN
Mol. Mass.:
53864.66
Organism:
Homo sapiens (Human)
Description:
ChEMBL_642034
Residue:
482
  
Inhibitor
Name:
BDBM50388995
Synonyms:
CHEMBL2064019
Type:
Small organic molecule
Emp. Form.:
C93H141N31O20
Mol. Mass.:
2013.3103
SMILES:
CC(C)C[C@H](NC(=O)CNC(=O)[C@H](CC(C)C)NC(=O)[C@H](CCCCN)NC(=O)[C@H](CO)NC(=O)[C@H](C)NC(=O)[C@H](CCCN=C(N)N)NC(=O)[C@H](Cc1c[nH]c2ccccc12)NC(=O)[C@H](CCCN=C(N)N)NC(=O)[C@H](CCCN=C(N)N)NC(=O)[C@H](CCC(O)=O)NC(=O)[C@H](Cc1c[nH]c2ccccc12)NC(=O)[C@H](Cc1c[nH]c2ccccc12)NC(C)=O)C(=O)N[C@@H](C)C(=O)N[C@@H](CCCN=C(N)N)C(O)=O
: