Target
N-acylethanolamine-hydrolyzing acid amidase
Ligand
BDBM50389018
Substrate
Meas. Tech.
ChEMBL_832910 (CHEMBL2066781)
IC50
1000±n/a nM
Citation
 Duranti, ATontini, AAntonietti, FVacondio, FFioni, ASilva, CLodola, ARivara, SSolorzano, CPiomelli, DTarzia, GMor, M N-(2-oxo-3-oxetanyl)carbamic acid esters as N-acylethanolamine acid amidase inhibitors: synthesis and structure-activity and structure-property relationships. J Med Chem 55:4824-36 (2012)  
Target
Name:
N-acylethanolamine-hydrolyzing acid amidase
Synonyms:
ASAH-like protein N-acylethanolamine acid amidase (NAAA) N-acylethanolamine-hydrolyzing acid amidase (NAAA) N-acylethanolamine-hydrolyzing acid amidase subunit beta NAAA_RAT | Naaa
Type:
Enzyme
Mol. Mass.:
40306.53
Organism:
Rattus norvegicus (Rat)
Description:
Q5KTC7
Residue:
362
  
Inhibitor
Name:
BDBM50389018
Synonyms:
CHEMBL2064175
Type:
Small organic molecule
Emp. Form.:
C12H13NO4
Mol. Mass.:
235.2359
SMILES:
C[C@@H]1OC(=O)[C@@H]1NC(=O)OCc1ccccc1
: