Target
Casein kinase I isoform epsilon
Ligand
BDBM50389086
Substrate
Meas. Tech.
ChEMBL_833717 (CHEMBL2066816)
IC50
>100000±n/a nM
Citation
 Lo Monte, FKramer, TGu, JAnumala, URMarinelli, LLa Pietra, VNovellino, EFranco, BDemedts, DVan Leuven, FFuertes, ADominguez, JMPlotkin, BEldar-Finkelman, HSchmidt, B Identification of glycogen synthase kinase-3 inhibitors with a selective sting for glycogen synthase kinase-3a. J Med Chem 55:4407-24 (2012)  
Target
Name:
Casein kinase I isoform epsilon
Synonyms:
Axin-1/Casein kinase I epsilon CKIe Casein kinase 1 epsilon (CK1Ɛ) Casein kinase I isoform epsilon (CK1 epsilon) Casein kinase I isoform epsilon (CK1epsilon) | KC1E_HUMAN
Type:
Protein
Mol. Mass.:
47340.25
Organism:
Homo sapiens (Human)
Description:
P49674
Residue:
416
  
Inhibitor
Name:
BDBM50389086
Synonyms:
CHEMBL2064531
Type:
Small organic molecule
Emp. Form.:
C22H16N2O3S
Mol. Mass.:
388.439
SMILES:
C(Sc1nnc(o1)-c1ccc2OCOc2c1)c1ccc(cc1)-c1ccccc1
: