Target
Glycogen synthase kinase-3 beta
Ligand
BDBM50389083
Substrate
Meas. Tech.
ChEMBL_833720 (CHEMBL2066819)
IC50
185±n/a nM
Citation
 Lo Monte, FKramer, TGu, JAnumala, URMarinelli, LLa Pietra, VNovellino, EFranco, BDemedts, DVan Leuven, FFuertes, ADominguez, JMPlotkin, BEldar-Finkelman, HSchmidt, B Identification of glycogen synthase kinase-3 inhibitors with a selective sting for glycogen synthase kinase-3a. J Med Chem 55:4407-24 (2012)  
Target
Name:
Glycogen synthase kinase-3 beta
Synonyms:
GSK-3 beta GSK3B Glycogen synthase kinase 3 beta (GSK3B) Glycogen synthase kinase-3 beta (GSK-3B) Glycogen synthase kinase-3 beta (GSK3B) Glycogen synthase kinase-3beta (GSK3B) | Serine/threonine-protein kinase GSK3B
Type:
Enzyme
Mol. Mass.:
46756.38
Organism:
Homo sapiens (Human)
Description:
P49841
Residue:
420
  
Inhibitor
Name:
BDBM50389083
Synonyms:
CHEMBL2064535
Type:
Small organic molecule
Emp. Form.:
C24H16FN3O3S
Mol. Mass.:
445.466
SMILES:
Fc1ccc(-c2ccc(CSc3nnc(o3)-c3ccc4OCCOc4c3)cc2)c(c1)C#N
: