Target
Adenosine receptor A1
Ligand
BDBM50100423
Substrate
Meas. Tech.
ChEMBL_833201 (CHEMBL2067492)
Ki
700±n/a nM
Citation
 Tosh, DKDeflorian, FPhan, KGao, ZGWan, TCGizewski, EAuchampach, JAJacobson, KA Structure-guided design of A(3) adenosine receptor-selective nucleosides: combination of 2-arylethynyl and bicyclo[3.1.0]hexane substitutions. J Med Chem 55:4847-60 (2012)  
Target
Name:
Adenosine receptor A1
Synonyms:
A1 adenosine receptor (hA1) AA1R_HUMAN ADORA1 Adenosine A1-receptor Adenosine receptor A1 (hA1) | Adenosine transporter (AdT)
Type:
G Protein-Coupled Receptor (GPCR)
Mol. Mass.:
36520.92
Organism:
Homo sapiens (Human)
Description:
P30542
Residue:
326
  
Inhibitor
Name:
BDBM50100423
Synonyms:
(1S,2R,3S,4R,5S)-2,3-Dihydroxy-4-[6-(3-iodo-benzylamino)-purin-9-yl]-bicyclo[3.1.0]hexane-1-carboxylic acid methylamide CHEMBL280580
Type:
Small organic molecule
Emp. Form.:
C20H21IN6O3
Mol. Mass.:
520.3236
SMILES:
CNC(=O)[C@@]12C[C@@H]1[C@H]([C@H](O)[C@@H]2O)n1cnc2c(NCc3cccc(I)c3)ncnc12
: