Target
Mitogen-activated protein kinase kinase kinase kinase 2
Ligand
BDBM50389154
Substrate
Meas. Tech.
ChEMBL_833230 (CHEMBL2067594)
IC50
60±n/a nM
Citation
 Gingrich, DELisko, JGCurry, MACheng, MQuail, MLu, LWan, WAlbom, MSAngeles, TSAimone, LDHaltiwanger, RCWells-Knecht, KOtt, GRGhose, AKAtor, MARuggeri, BDorsey, BD Discovery of an orally efficacious inhibitor of anaplastic lymphoma kinase. J Med Chem 55:4580-93 (2012)  
Target
Name:
Mitogen-activated protein kinase kinase kinase kinase 2
Synonyms:
2.7.11.1 GC kinase Germinal center kinase MAP4K2 MEK kinase kinase 2 RAB8IP | Rab8-interacting protein
Type:
Mol. Mass.:
91551.35
Organism:
Homo sapiens (Human)
Description:
Residue:
820
  
Inhibitor
Name:
BDBM50389154
Synonyms:
CHEMBL2064666
Type:
Small organic molecule
Emp. Form.:
C28H35ClN6O3
Mol. Mass.:
539.069
SMILES:
COc1c(Nc2ncc(Cl)c(N[C@@H]3[C@@H]4C[C@@H](C=C4)[C@@H]3C(N)=O)n2)ccc2CC[C@@H](CCc12)N1CCOCC1
: