Target
Excitatory amino acid transporter 1
Ligand
BDBM50328510
Substrate
Meas. Tech.
ChEMBL_833020 (CHEMBL2067159)
IC50
3900±n/a nM
Citation
 Huynh, THShim, IBohr, HAbrahamsen, BNielsen, BJensen, AABunch, L Structure-activity relationship study of selective excitatory amino acid transporter subtype 1 (EAAT1) inhibitor 2-amino-4-(4-methoxyphenyl)-7-(naphthalen-1-yl)-5-oxo-5,6,7,8-tetrahydro-4H-chromene-3-carbonitrile (UCPH-101) and absolute configurational assignment using infrared and vibrational circ J Med Chem 55:5403-12 (2012)  
Target
Name:
Excitatory amino acid transporter 1
Synonyms:
EAA1_HUMAN Excitatory Amino Acid EAAT1 GLAST1 | SLC1A3
Type:
Enzyme Catalytic Domain
Mol. Mass.:
59577.19
Organism:
Homo sapiens (Human)
Description:
Excitatory Amino Acid EAAT1 0 HUMAN::P43003
Residue:
542
  
Inhibitor
Name:
BDBM50328510
Synonyms:
2-Amino-5-oxo-4,7-diphenyl-5,6,7,8-tetrahydro-4H-chromene-3-carbonitrile | CHEMBL1258989
Type:
Small organic molecule
Emp. Form.:
C22H18N2O2
Mol. Mass.:
342.3905
SMILES:
N=C1OC2=C(C(C1C#N)c1ccccc1)C(=O)CC(C2)c1ccccc1
: