Target
Tyrosine-protein kinase JAK2
Ligand
BDBM99612
Substrate
Meas. Tech.
ChEMBL_833247 (CHEMBL2067611)
IC50
5.6±n/a nM
Citation
 Dugan, BJGingrich, DEMesaros, EFMilkiewicz, KLCurry, MAZulli, ALDobrzanski, PSerdikoff, CJan, MAngeles, TSAlbom, MSMason, JLAimone, LDMeyer, SLHuang, ZWells-Knecht, KJAtor, MARuggeri, BADorsey, BD A selective, orally bioavailable 1,2,4-triazolo[1,5-a]pyridine-based inhibitor of Janus kinase 2 for use in anticancer therapy: discovery of CEP-33779. J Med Chem 55:5243-54 (2012)  
Target
Name:
Tyrosine-protein kinase JAK2
Synonyms:
JAK-2 JAK2_HUMAN Janus kinase 2 (JAK2) | Janus kinase 2 (a protein tyrosine kinase)
Type:
Protein
Mol. Mass.:
130684.68
Organism:
Homo sapiens (Human)
Description:
O60674
Residue:
1132
  
Inhibitor
Name:
BDBM99612
Synonyms:
CHEMBL2062800 | US8501936, 113
Type:
Small organic molecule
Emp. Form.:
C20H18N4O4S2
Mol. Mass.:
442.511
SMILES:
CS(=O)(=O)c1ccc(cc1)-c1cccn2nc(Nc3cccc(c3)S(C)(=O)=O)nc12
: