Target
Tyrosine-protein kinase JAK2
Ligand
BDBM99619
Substrate
Meas. Tech.
ChEMBL_833247 (CHEMBL2067611)
IC50
0.64±n/a nM
Citation
 Dugan, BJGingrich, DEMesaros, EFMilkiewicz, KLCurry, MAZulli, ALDobrzanski, PSerdikoff, CJan, MAngeles, TSAlbom, MSMason, JLAimone, LDMeyer, SLHuang, ZWells-Knecht, KJAtor, MARuggeri, BADorsey, BD A selective, orally bioavailable 1,2,4-triazolo[1,5-a]pyridine-based inhibitor of Janus kinase 2 for use in anticancer therapy: discovery of CEP-33779. J Med Chem 55:5243-54 (2012)  
Target
Name:
Tyrosine-protein kinase JAK2
Synonyms:
JAK-2 JAK2_HUMAN Janus kinase 2 (JAK2) | Janus kinase 2 (a protein tyrosine kinase)
Type:
Protein
Mol. Mass.:
130684.68
Organism:
Homo sapiens (Human)
Description:
O60674
Residue:
1132
  
Inhibitor
Name:
BDBM99619
Synonyms:
CHEMBL2062807 | US8501936, 120
Type:
Small organic molecule
Emp. Form.:
C24H25N5O4S2
Mol. Mass.:
511.616
SMILES:
CS(=O)(=O)c1ccc(cc1)-c1cccn2nc(Nc3cccc(CN4CCS(=O)(=O)CC4)c3)nc12
: