Target
Tyrosine-protein kinase JAK3
Ligand
BDBM50389202
Substrate
Meas. Tech.
ChEMBL_833042 (CHEMBL2067181)
IC50
547±n/a nM
Citation
 Dugan, BJGingrich, DEMesaros, EFMilkiewicz, KLCurry, MAZulli, ALDobrzanski, PSerdikoff, CJan, MAngeles, TSAlbom, MSMason, JLAimone, LDMeyer, SLHuang, ZWells-Knecht, KJAtor, MARuggeri, BADorsey, BD A selective, orally bioavailable 1,2,4-triazolo[1,5-a]pyridine-based inhibitor of Janus kinase 2 for use in anticancer therapy: discovery of CEP-33779. J Med Chem 55:5243-54 (2012)  
Target
Name:
Tyrosine-protein kinase JAK3
Synonyms:
JAK-3 JAK3_HUMAN Janus kinase 3 (JAK3) L-JAK | Leukocyte janus kinase
Type:
Protein
Mol. Mass.:
125111.08
Organism:
Homo sapiens (Human)
Description:
P52333
Residue:
1124
  
Inhibitor
Name:
BDBM50389202
Synonyms:
CHEMBL2062812 | US8501936, 365
Type:
Small organic molecule
Emp. Form.:
C23H23FN6
Mol. Mass.:
402.4673
SMILES:
CN1CCN(CC1)c1cccc(Nc2nc3c(cccn3n2)-c2ccc(F)cc2)c1
: