Target
Aurora kinase B
Ligand
BDBM50389253
Substrate
Meas. Tech.
ChEMBL_831558 (CHEMBL2064921)
IC50
3±n/a nM
Citation
 Ji, ZDai, YAbad-Zapatero, CAlbert, DHBouska, JJGlaser, KBMarcotte, PASoni, NBMagoc, TJStewart, KDWei, RQDavidsen, SKMichaelides, MR Exploration of diverse hinge-binding scaffolds for selective Aurora kinase inhibitors. Bioorg Med Chem Lett 22:4528-31 (2012)  
Target
Name:
Aurora kinase B
Synonyms:
AIK2 AIM1 ARK2 AURKB_HUMAN Aurora B-INCENP Aurora kinase B (AURKB) STK-1 STK12 Serine/threonine-protein kinase aurora B
Type:
Protein
Mol. Mass.:
39327.72
Organism:
Homo sapiens (Human)
Description:
Q96GD4
Residue:
344
  
Inhibitor
Name:
BDBM50389253
Synonyms:
CHEMBL2063444
Type:
Small organic molecule
Emp. Form.:
C22H18ClN5O3
Mol. Mass.:
435.863
SMILES:
Nc1noc2cccc(C(=O)Nc3cccc(CNC(=O)Nc4ccc(Cl)cc4)c3)c12
: