Target
Aurora kinase A
Ligand
BDBM50389263
Substrate
Meas. Tech.
ChEMBL_831557 (CHEMBL2064920)
IC50
37±n/a nM
Citation
 Ji, ZDai, YAbad-Zapatero, CAlbert, DHBouska, JJGlaser, KBMarcotte, PASoni, NBMagoc, TJStewart, KDWei, RQDavidsen, SKMichaelides, MR Exploration of diverse hinge-binding scaffolds for selective Aurora kinase inhibitors. Bioorg Med Chem Lett 22:4528-31 (2012)  
Target
Name:
Aurora kinase A
Synonyms:
AIK ARK1 AURKA AYK1 Aurora kinase A (AURA) Aurora kinase A (Aurora A) Aurora-related kinase 1 BTAK Breast-tumor-amplified kinase STK15 Serine/threonine kinase 15 Serine/threonine-protein kinase aurora A hARK1
Type:
Serine/threonine-protein kinase
Mol. Mass.:
45830.98
Organism:
Homo sapiens (Human)
Description:
O14965
Residue:
403
  
Inhibitor
Name:
BDBM50389263
Synonyms:
CHEMBL2063466
Type:
Small organic molecule
Emp. Form.:
C19H21N7O2
Mol. Mass.:
379.4157
SMILES:
Nc1ncnn2ccc(C(=O)Nc3ccc(NC(=O)NC4CCCC4)cc3)c12
: