Target
Aurora kinase A
Ligand
BDBM50389259
Substrate
Meas. Tech.
ChEMBL_831557 (CHEMBL2064920)
IC50
>12500±n/a nM
Citation
 Ji, ZDai, YAbad-Zapatero, CAlbert, DHBouska, JJGlaser, KBMarcotte, PASoni, NBMagoc, TJStewart, KDWei, RQDavidsen, SKMichaelides, MR Exploration of diverse hinge-binding scaffolds for selective Aurora kinase inhibitors. Bioorg Med Chem Lett 22:4528-31 (2012)  
Target
Name:
Aurora kinase A
Synonyms:
AIK ARK1 AURKA AYK1 Aurora kinase A (AURA) Aurora kinase A (Aurora A) Aurora-related kinase 1 BTAK Breast-tumor-amplified kinase STK15 Serine/threonine kinase 15 Serine/threonine-protein kinase aurora A hARK1
Type:
Serine/threonine-protein kinase
Mol. Mass.:
45830.98
Organism:
Homo sapiens (Human)
Description:
O14965
Residue:
403
  
Inhibitor
Name:
BDBM50389259
Synonyms:
CHEMBL2063445
Type:
Small organic molecule
Emp. Form.:
C22H18FN5O3
Mol. Mass.:
419.4084
SMILES:
Nc1noc2cccc(C(=O)Nc3cccc(CNC(=O)Nc4ccccc4F)c3)c12
: