Target
Alpha-synuclein
Ligand
BDBM50389302
Substrate
Meas. Tech.
ChEMBL_831727 (CHEMBL2065090)
IC50
23491±n/a nM
Citation
 Yu, LCui, JPadakanti, PKEngel, LBagchi, DPKotzbauer, PTTu, Z Synthesis and in vitro evaluation ofa-synuclein ligands. Bioorg Med Chem 20:4625-34 (2012)  
Target
Name:
Alpha-synuclein
Synonyms:
NACP SNCA | SYUA_HUMAN
Type:
Protein
Mol. Mass.:
14451.42
Organism:
Homo sapiens (Human)
Description:
P37840
Residue:
140
  
Inhibitor
Name:
BDBM50389302
Synonyms:
CHEMBL2063795
Type:
Small organic molecule
Emp. Form.:
C14H10N2O3S
Mol. Mass.:
286.306
SMILES:
CC(=O)N1c2ccccc2Sc2cc(ccc12)[N+]([O-])=O
: