Target
Acetylcholinesterase
Ligand
BDBM50389382
Substrate
Meas. Tech.
ChEMBL_831935 (CHEMBL2066009)
Ki
1.35±n/a nM
Citation
 Hamulakova, SJanovec, LHrabinova, MKristian, PKuca, KBanasova, MImrich, J Synthesis, design and biological evaluation of novel highly potent tacrine congeners for the treatment of Alzheimer's disease. Eur J Med Chem 55:23-31 (2012)  
Target
Name:
Acetylcholinesterase
Synonyms:
ACES_HUMAN Acetylcholinesterase (AChE) | Acetylcholinesterase (human AChE)
Type:
Enzyme
Mol. Mass.:
67792.70
Organism:
Homo sapiens (Human)
Description:
P22303
Residue:
614
  
Inhibitor
Name:
BDBM50389382
Synonyms:
CHEMBL2064465
Type:
Small organic molecule
Emp. Form.:
C30H45N5O
Mol. Mass.:
491.7112
SMILES:
CCN(CCC(=O)N1CCN(CCNc2c3CCCCc3nc3ccccc23)CC1)C1CCCCC1
: