Target
Cholinesterase
Ligand
BDBM50327939
Substrate
Meas. Tech.
ChEMBL_831933 (CHEMBL2066007)
IC50
21000±n/a nM
Citation
 Hamulakova, SJanovec, LHrabinova, MKristian, PKuca, KBanasova, MImrich, J Synthesis, design and biological evaluation of novel highly potent tacrine congeners for the treatment of Alzheimer's disease. Eur J Med Chem 55:23-31 (2012)  
Target
Name:
Cholinesterase
Synonyms:
Acylcholine acylhydrolase Butyrylcholine esterase (BChE) Butyrylcholinesterase (BuChE) CHLE_HUMAN Cholinesterases Pseudocholinesterase
Type:
Homotetramer
Mol. Mass.:
68422.27
Organism:
Homo sapiens (Human)
Description:
P06276
Residue:
602
  
Inhibitor
Name:
BDBM50327939
Synonyms:
7-methoxytacrine | CHEMBL1256415
Type:
Small organic molecule
Emp. Form.:
C14H16N2O
Mol. Mass.:
228.2896
SMILES:
COc1ccc2nc3CCCCc3c(N)c2c1
: