Target
Cholinesterase
Ligand
BDBM50389379
Substrate
Meas. Tech.
ChEMBL_831933 (CHEMBL2066007)
IC50
211±n/a nM
Citation
 Hamulakova, SJanovec, LHrabinova, MKristian, PKuca, KBanasova, MImrich, J Synthesis, design and biological evaluation of novel highly potent tacrine congeners for the treatment of Alzheimer's disease. Eur J Med Chem 55:23-31 (2012)  
Target
Name:
Cholinesterase
Synonyms:
Acylcholine acylhydrolase Butyrylcholine esterase (BChE) Butyrylcholinesterase (BuChE) CHLE_HUMAN Cholinesterases Pseudocholinesterase
Type:
Homotetramer
Mol. Mass.:
68422.27
Organism:
Homo sapiens (Human)
Description:
P06276
Residue:
602
  
Inhibitor
Name:
BDBM50389379
Synonyms:
CHEMBL2064470
Type:
Small organic molecule
Emp. Form.:
C29H39N5
Mol. Mass.:
457.6535
SMILES:
CN(CCCN1CCN(CCNc2c3CCCCc3nc3ccccc23)CC1)c1ccccc1
: