Target
Cholinesterase
Ligand
BDBM50389383
Substrate
Meas. Tech.
ChEMBL_831933 (CHEMBL2066007)
IC50
63.7±n/a nM
Citation
 Hamulakova, SJanovec, LHrabinova, MKristian, PKuca, KBanasova, MImrich, J Synthesis, design and biological evaluation of novel highly potent tacrine congeners for the treatment of Alzheimer's disease. Eur J Med Chem 55:23-31 (2012)  
Target
Name:
Cholinesterase
Synonyms:
Acylcholine acylhydrolase Butyrylcholine esterase (BChE) Butyrylcholinesterase (BuChE) CHLE_HUMAN Cholinesterases Pseudocholinesterase
Type:
Homotetramer
Mol. Mass.:
68422.27
Organism:
Homo sapiens (Human)
Description:
P06276
Residue:
602
  
Inhibitor
Name:
BDBM50389383
Synonyms:
CHEMBL2064464
Type:
Small organic molecule
Emp. Form.:
C29H43N5O
Mol. Mass.:
477.6846
SMILES:
CN(CCC(=O)N1CCN(CCNc2c3CCCCc3nc3ccccc23)CC1)C1CCCCC1
: