Target
N-acylethanolamine-hydrolyzing acid amidase
Ligand
BDBM50389023
Substrate
Meas. Tech.
ChEMBL_834061 (CHEMBL2072801)
IC50
7.3±n/a nM
Citation
 Armirotti, ARomeo, EPonzano, SMengatto, LDionisi, MKaracsonyi, CBertozzi, FGarau, GTarozzo, GReggiani, ABandiera, TTarzia, GMor, MPiomelli, D ß-Lactones Inhibit N-acylethanolamine Acid Amidase by S-Acylation of the Catalytic N-Terminal Cysteine. ACS Med Chem Lett 3:422-426 (2012)  
Target
Name:
N-acylethanolamine-hydrolyzing acid amidase
Synonyms:
ASAH-like protein Acid ceramidase-like protein N-acylsphingosine amidohydrolase-like NAAA PLT
Type:
Enzyme
Mol. Mass.:
40073.12
Organism:
Homo sapiens (Human)
Description:
Q02083
Residue:
359
  
Inhibitor
Name:
BDBM50389023
Synonyms:
CHEMBL2064166 | US9353075, 6
Type:
Small organic molecule
Emp. Form.:
C16H21NO4
Mol. Mass.:
291.3422
SMILES:
C[C@@H]1OC(=O)[C@@H]1NC(=O)OCCCCCc1ccccc1
: