Target
Aurora kinase B
Ligand
BDBM50389977
Substrate
Meas. Tech.
ChEMBL_835007 (CHEMBL2073499)
IC50
66±n/a nM
Citation
 Curtin, MLHeyman, HRFrey, RRMarcotte, PAGlaser, KBJankowski, JRMagoc, TJAlbert, DHOlson, AMReuter, DRBouska, JJMontgomery, DAPalma, JPDonawho, CKStewart, KDTse, CMichaelides, MR Pyrazole diaminopyrimidines as dual inhibitors of KDR and Aurora B kinases. Bioorg Med Chem Lett 22:4750-5 (2012)  
Target
Name:
Aurora kinase B
Synonyms:
AIK2 AIM1 ARK2 AURKB_HUMAN Aurora B-INCENP Aurora kinase B (AURKB) STK-1 STK12 Serine/threonine-protein kinase aurora B
Type:
Protein
Mol. Mass.:
39327.72
Organism:
Homo sapiens (Human)
Description:
Q96GD4
Residue:
344
  
Inhibitor
Name:
BDBM50389977
Synonyms:
CHEMBL2071203
Type:
Small organic molecule
Emp. Form.:
C17H20F3N7O
Mol. Mass.:
395.3822
SMILES:
Cn1cc(Nc2ncc(c(N[C@@H]3[C@H]4CC[C@H](C4)[C@@H]3C(N)=O)n2)C(F)(F)F)cn1
: