Target
Inhibitor of nuclear factor kappa-B kinase subunit beta
Ligand
BDBM50149806
Substrate
Meas. Tech.
ChEMBL_835035 (CHEMBL2073527)
IC50
1800±n/a nM
Citation
 Song, HLee, YSRoh, EJSeo, JHOh, KSLee, BHHan, HShin, KJ Discovery of potent and selective rhodanine type IKKß inhibitors by hit-to-lead strategy. Bioorg Med Chem Lett 22:5668-74 (2012)  
Target
Name:
Inhibitor of nuclear factor kappa-B kinase subunit beta
Synonyms:
IKKB_MOUSE Ikkb
Type:
PROTEIN
Mol. Mass.:
86687.79
Organism:
Mus musculus
Description:
ChEMBL_835035
Residue:
757
  
Inhibitor
Name:
BDBM50149806
Synonyms:
2''-Amino-6''-(2-hydroxy-phenyl)-1,2,3,4,5,6-hexahydro-[3,4'']bipyridinyl-3''-carbonitrile CHEMBL360077
Type:
Small organic molecule
Emp. Form.:
C17H18N4O
Mol. Mass.:
294.351
SMILES:
Nc1nc(cc(C2CCCNC2)c1C#N)-c1ccccc1O
: