Target
Plasmepsin II
Ligand
BDBM50323737
Substrate
Meas. Tech.
ChEMBL_835449 (CHEMBL2072155)
Ki
0.4±n/a nM
Citation
 Vaiana, NMarzahn, MParapini, SLiu, PDell'Agli, MPancotti, ASangiovanni, EBasilico, NBosisio, EDunn, BMTaramelli, DRomeo, S Antiplasmodial activities of 4-aminoquinoline-statine compounds. Bioorg Med Chem Lett 22:5915-8 (2012)  
Target
Name:
Plasmepsin II
Synonyms:
Aspartic hemoglobinase II PLM2_PLAFX Plasmepsin 2 Plasmepsin-II
Type:
Enzyme
Mol. Mass.:
51482.09
Organism:
Plasmodium falciparum
Description:
P46925
Residue:
453
  
Inhibitor
Name:
BDBM50323737
Synonyms:
CHEMBL1213687 | N-((2S)-1-((2S)-6-amino-1-(4-(6-methoxyquinolin-8-ylamino)pentylamino)-1-oxohexan-2-ylamino)-4-methyl-1-oxopentan-2-yl)-4-(4-((2S,3S)-1-((3S,4S)-1-(butylamino)-3-hydroxy-6-methyl-1-oxoheptan-4-ylamino)-3-methyl-1-oxopentan-2-ylcarbamoyl)phenoxy)benzamide
Type:
Small organic molecule
Emp. Form.:
C59H87N9O9
Mol. Mass.:
1066.377
SMILES:
CCCCNC(=O)C[C@H](O)[C@H](CC(C)C)NC(=O)[C@@H](NC(=O)c1ccc(Oc2ccc(cc2)C(=O)N[C@@H](CC(C)C)C(=O)N[C@@H](CCCCN)C(=O)NCCCC(C)Nc2cc(OC)cc3cccnc23)cc1)[C@@H](C)CC
: