Target
Aldo-keto reductase family 1 member C1
Ligand
BDBM50390661
Substrate
Meas. Tech.
ChEMBL_835619 (CHEMBL2071730)
IC50
8400±n/a nM
Citation
 Sinreih, MSosic, IBeranic, NTurk, SAdeniji, AOPenning, TMRižner, TLGobec, S N-Benzoyl anthranilic acid derivatives as selective inhibitors of aldo-keto reductase AKR1C3. Bioorg Med Chem Lett 22:5948-51 (2012)  
Target
Name:
Aldo-keto reductase family 1 member C1
Synonyms:
20-alpha-HSD AK1C1_HUMAN Aldo-keto reductase family 1 member C1 (AK1C1) Aldo-keto reductase family 1 member C1 (AKR1C1) DDH High-affinity hepatic bile acid-binding protein | Trans-1,2-dihydrobenzene-1,2-diol dehydrogenase
Type:
Enzyme
Mol. Mass.:
36793.97
Organism:
Homo sapiens (Human)
Description:
Recombinant AKR1C1 enzyme was expressed in E. coli.
Residue:
323
  
Inhibitor
Name:
BDBM50390661
Synonyms:
CHEMBL2070000
Type:
Small organic molecule
Emp. Form.:
C14H8BrFN2O5
Mol. Mass.:
383.126
SMILES:
OC(=O)c1cc(Br)ccc1NC(=O)c1ccc(F)c(c1)[N+]([O-])=O
: