Target
cAMP and cAMP-inhibited cGMP 3',5'-cyclic phosphodiesterase 10A
Ligand
BDBM50390829
Substrate
Meas. Tech.
ChEMBL_835769 (CHEMBL2071880)
IC50
1.48±n/a nM
Citation
 Malamas, MSStange, HSchindler, RLankau, HJGrunwald, CLangen, BEgerland, UHage, TNi, YErdei, JFan, KYParris, KMarquis, KLGrauer, SBrennan, JNavarra, RGraf, RHarrison, BLRobichaud, AKronbach, TPangalos, MNBrandon, NJHoefgen, N Novel triazines as potent and selective phosphodiesterase 10A inhibitors. Bioorg Med Chem Lett 22:5876-84 (2012)  
Target
Name:
cAMP and cAMP-inhibited cGMP 3',5'-cyclic phosphodiesterase 10A
Synonyms:
3',5'-cyclic phosphodiesterase PDE10_HUMAN Phosphodiesterase 10A
Type:
Protein
Mol. Mass.:
88412.52
Organism:
Homo sapiens (Human)
Description:
Q9Y233
Residue:
779
  
Inhibitor
Name:
BDBM50390829
Synonyms:
CHEMBL2070666
Type:
Small organic molecule
Emp. Form.:
C18H14F3N5O
Mol. Mass.:
373.3319
SMILES:
COc1cc(cc2c1nnc1c(C)nc(-c3ccncc3C)n21)C(F)(F)F
: