Target
Translocator protein
Ligand
BDBM50255877
Substrate
Meas. Tech.
ChEMBL_835804 (CHEMBL2071915)
Ki
0.28±n/a nM
Citation
 Wadsworth, HJones, PAChau, WFDurrant, CMorisson-Iveson, VPassmore, JO'Shea, DWynn, DKhan, IBlack, AAvory, MTrigg, W Exploration of the structure-activity relationship of the diaryl anilide class of ligands for translocator protein--potential novel positron emitting tomography imaging agents. Bioorg Med Chem Lett 22:5795-800 (2012)  
Target
Name:
Translocator protein
Synonyms:
Benzodiazepine receptors; peripheral & central Mbr PBR Peripheral benzodiazepine receptor (PBR) TSPO_RAT | Tspo
Type:
Mitochondrion membrane protein
Mol. Mass.:
18945.84
Organism:
Rattus norvegicus (rat)
Description:
Competitive binding experiments were performed on rat kidney mitochondrial membranes.
Residue:
169
  
Inhibitor
Name:
BDBM50255877
Synonyms:
CHEMBL473435 | N-Fluoroacetyl-N-(2,5-dimethoxybenzyl)-2-phenoxyaniline
Type:
Small organic molecule
Emp. Form.:
C23H22FNO4
Mol. Mass.:
395.4235
SMILES:
COc1ccc(OC)c(CN(C(=O)CF)c2ccccc2Oc2ccccc2)c1
: