Target
Solute carrier family 22 member 1
Ligand
BDBM50149890
Substrate
Meas. Tech.
ChEMBL_836338 (CHEMBL2076502)
Ki
286000±n/a nM
Citation
 Chen, RNelson, JA Role of organic cation transporters in the renal secretion of nucleosides. Biochem Pharmacol 60:215-9 (2000)  
Target
Name:
Solute carrier family 22 member 1
Synonyms:
Adrenaline alpha1 Organic cation transporter 1 Slc22a1 adrenergic Alpha1 | rOCT1
Type:
Enzyme Catalytic Domain
Mol. Mass.:
61538.40
Organism:
RAT
Description:
Adrenaline alpha1 0 RAT::Q63089
Residue:
556
  
Inhibitor
Name:
BDBM50149890
Synonyms:
CHEMBL9324 | tetraethylammonium
Type:
Small organic molecule
Emp. Form.:
C8H20N
Mol. Mass.:
130.2506
SMILES:
CC[N+](CC)(CC)CC
: