Target
ATP-binding cassette sub-family C member 2
Ligand
BDBM50390985
Substrate
Meas. Tech.
ChEMBL_839289 (CHEMBL2077960)
Ki
8320±n/a nM
Citation
 Akhteruzzaman, SKato, YHisaka, ASugiyama, Y Primary active transport of peptidic endothelin antagonists by rat hepatic canalicular membrane. J Pharmacol Exp Ther 288:575-81 (1999) Target
Name:
ATP-binding cassette sub-family C member 2
Synonyms:
ATP-binding cassette sub-family C member 2 Canalicular multidrug resistance protein Cmoat MRP2_RAT Multidrug resistance-associated protein 2
Type:
PROTEIN
Mol. Mass.:
173415.22
Organism:
Rattus norvegicus
Description:
ChEMBL_1455464
Residue:
1541
  
Inhibitor
Name:
BDBM50390985
Synonyms:
CHEMBL2074707
Type:
Small organic molecule
Emp. Form.:
C35H44N6O5
Mol. Mass.:
628.7611
SMILES:
CC(C)C[C@H](NC(=O)N1CCCCCC1)C(=O)NC(Cc1c[nH]c2ccccc12)C(=O)N[C@H](Cc1c[nH]c2ccccc12)C(O)=O
: